Return-path: <jenkins@ssf.com.mx>
Envelope-to: christian@ssf.com.mx
Delivery-date: Mon, 08 Feb 2016 13:26:50 -0600
Received: from [108.161.137.201] (port=48373 helo=develop)
	by vishnu.hosting-mexico.net with esmtpsa (TLSv1:ECDHE-RSA-AES256-SHA:256)
	(Exim 4.86)
	(envelope-from <jenkins@ssf.com.mx>)
	id 1aSrSR-0029N7-RZ; Mon, 08 Feb 2016 13:26:50 -0600
Date: Mon, 8 Feb 2016 13:26:49 -0600 (CST)
From: Jenkins Daemon  <jenkins@ssf.com.mx>
To: rogelio@ssf.mx, christian@ssf.com.mx
Message-ID: <1032668028.12.1454959609232.JavaMail.jenkins@develop>
In-Reply-To: <1894191999.11.1454958002160.JavaMail.jenkins@develop>
References: <1894191999.11.1454958002160.JavaMail.jenkins@develop>
Subject: Build failed in Jenkins: G4S #260
MIME-Version: 1.0
Content-Type: text/plain; charset=UTF-8
Content-Transfer-Encoding: 7bit
X-Instance-Identity: MIIBIjANBgkqhkiG9w0BAQEFAAOCAQ8AMIIBCgKCAQEAi2ydT5Xf4kWnW3BRetUOELKEI6SQEm50fSYVmXfSU6E5EGPBtBno4RsmaFkvsf8u9jfLMXbWehHXWvjipNyzquDXIF13cKAfpk5geYHVWsgHpAmQd1uagpvxosIcVO9OYU3LYTXUwcKys0vx/V1n9deAegYZsV6hnHZrPrGBCD5LLE3GHXGMOweszQcbzPDbXK4UEbpP/KMYnAPr/BZrC7WGlIn7AKVGxprhO0BNxAZP1JslaHcsidMAskkJBqkr7IA+Qyw9R1DegOJOT9+X113u2Hg1oyGWwy8YhFKlkCYImLvzzIygwl/sa+Scdw6U8gGTf0bf//QZCft4rnjbYQIDAQAB
X-Jenkins-Job: G4S
X-Jenkins-Result: FAILURE
X-OutGoing-Spam-Status: No, score=-2.9

See <http://108.161.137.201:8081/job/G4S/260/changes>

Changes:

[sicomadmin] cambio a version: 1.30.1-SNAPSHOT

------------------------------------------
[...truncated 327 lines...]
[INFO] Using 'UTF-8' encoding to copy filtered resources.
[INFO] skip non existing resourceDirectory <http://108.161.137.201:8081/job/G4S/ws/GasPAR-Commons/OperationalServices/src/main/resources>
[INFO] 
[INFO] --- maven-compiler-plugin:2.3.2:compile (default-compile) @ OperationalServices ---
[INFO] Compiling 44 source files to <http://108.161.137.201:8081/job/G4S/ws/GasPAR-Commons/OperationalServices/target/classes>
[INFO] 
[INFO] --- maven-resources-plugin:2.3:testResources (default-testResources) @ OperationalServices ---
[INFO] Using 'UTF-8' encoding to copy filtered resources.
[INFO] skip non existing resourceDirectory <http://108.161.137.201:8081/job/G4S/ws/GasPAR-Commons/OperationalServices/src/test/resources>
[INFO] 
[INFO] --- maven-compiler-plugin:2.3.2:testCompile (default-testCompile) @ OperationalServices ---
[INFO] Not compiling test sources
[INFO] 
[INFO] --- maven-surefire-plugin:2.10:test (default-test) @ OperationalServices ---
[INFO] Tests are skipped.
[INFO] 
[INFO] --- maven-jar-plugin:2.2:jar (default-jar) @ OperationalServices ---
[INFO] Building jar: <http://108.161.137.201:8081/job/G4S/ws/GasPAR-Commons/OperationalServices/target/OperationalServices-1.30.1-SNAPSHOT.jar>
[INFO] 
[INFO] --- maven-install-plugin:2.3:install (default-install) @ OperationalServices ---
[INFO] Installing <http://108.161.137.201:8081/job/G4S/ws/GasPAR-Commons/OperationalServices/target/OperationalServices-1.30.1-SNAPSHOT.jar> to /var/lib/jenkins/.m2/repository/mx/ssf/sicom/OperationalServices/1.30.1-SNAPSHOT/OperationalServices-1.30.1-SNAPSHOT.jar
[INFO] Installing <http://108.161.137.201:8081/job/G4S/ws/GasPAR-Commons/OperationalServices/pom.xml> to /var/lib/jenkins/.m2/repository/mx/ssf/sicom/OperationalServices/1.30.1-SNAPSHOT/OperationalServices-1.30.1-SNAPSHOT.pom
[INFO]                                                                         
[INFO] ------------------------------------------------------------------------
[INFO] Building JPADataAccess 1.30.1-SNAPSHOT
[INFO] ------------------------------------------------------------------------
[WARNING] The POM for mx.ssf.sicom:UsersManagement:jar:1.30.1-SNAPSHOT is missing, no dependency information available
[INFO] ------------------------------------------------------------------------
[INFO] Reactor Summary:
[INFO] 
[INFO] GasPAR-Commons .................................... SUCCESS [0.689s]
[INFO] CommonDomain ...................................... SUCCESS [5.250s]
[INFO] CatalogsServices .................................. SUCCESS [1.322s]
[INFO] CorporateStructureService ......................... SUCCESS [1.378s]
[INFO] OperationalServices ............................... SUCCESS [1.304s]
[INFO] JPADataAccess ..................................... FAILURE [0.130s]
[INFO] ScalaCommons ...................................... SKIPPED
[INFO] IntegrationCommands ............................... SKIPPED
[INFO] ------------------------------------------------------------------------
[INFO] BUILD FAILURE
[INFO] ------------------------------------------------------------------------
[INFO] Total time: 10.548s
[INFO] Finished at: Mon Feb 08 13:26:32 CST 2016
[INFO] Final Memory: 40M/338M
[INFO] ------------------------------------------------------------------------
[ERROR] Failed to execute goal on project JPADataAccess: Could not resolve dependencies for project mx.ssf.sicom:JPADataAccess:jar:1.30.1-SNAPSHOT: Failure to find mx.ssf.sicom:UsersManagement:jar:1.30.1-SNAPSHOT in http://177.240.165.135:8081/nexus/content/groups/public/ was cached in the local repository, resolution will not be reattempted until the update interval of nexus has elapsed or updates are forced -> [Help 1]
[ERROR] 
[ERROR] To see the full stack trace of the errors, re-run Maven with the -e switch.
[ERROR] Re-run Maven using the -X switch to enable full debug logging.
[ERROR] 
[ERROR] For more information about the errors and possible solutions, please read the following articles:
[ERROR] [Help 1] http://cwiki.apache.org/confluence/display/MAVEN/DependencyResolutionException
[ERROR] 
[ERROR] After correcting the problems, you can resume the build with the command
[ERROR]   mvn <goals> -rf :JPADataAccess
No importa si se compilo o no se compilo
+ ./mvnInstall.sh install <http://108.161.137.201:8081/job/G4S/ws/SCGasPAR/pom.xml>
[INFO] Scanning for projects...
[ERROR] The build could not read 1 project -> [Help 1]
[ERROR]   
[ERROR]   The project  (<http://108.161.137.201:8081/job/G4S/ws/SCGasPAR/UsersManagement/pom.xml)> has 1 error
[ERROR]     Non-readable POM <http://108.161.137.201:8081/job/G4S/ws/SCGasPAR/UsersManagement/pom.xml>: input contained no data
[ERROR] 
[ERROR] To see the full stack trace of the errors, re-run Maven with the -e switch.
[ERROR] Re-run Maven using the -X switch to enable full debug logging.
[ERROR] 
[ERROR] For more information about the errors and possible solutions, please read the following articles:
[ERROR] [Help 1] http://cwiki.apache.org/confluence/display/MAVEN/ProjectBuildingException
No importa si se compilo o no se compilo
[workspace] $ mvn -f GasPAR-Commons/pom.xml clean install -Dmaven.test.skip=true
[INFO] Scanning for projects...
[INFO] ------------------------------------------------------------------------
[INFO] Reactor Build Order:
[INFO] 
[INFO] GasPAR-Commons
[INFO] CommonDomain
[INFO] CatalogsServices
[INFO] CorporateStructureService
[INFO] OperationalServices
[INFO] JPADataAccess
[INFO] ScalaCommons
[INFO] IntegrationCommands
[INFO]                                                                         
[INFO] ------------------------------------------------------------------------
[INFO] Building GasPAR-Commons 1.30.1-SNAPSHOT
[INFO] ------------------------------------------------------------------------
[INFO] 
[INFO] --- maven-clean-plugin:2.5:clean (default-clean) @ GasPAR-Commons ---
[INFO] 
[INFO] --- maven-install-plugin:2.3:install (default-install) @ GasPAR-Commons ---
[INFO] Installing <http://108.161.137.201:8081/job/G4S/ws/GasPAR-Commons/pom.xml> to /var/lib/jenkins/.m2/repository/mx/ssf/sicom/GasPAR-Commons/1.30.1-SNAPSHOT/GasPAR-Commons-1.30.1-SNAPSHOT.pom
[INFO]                                                                         
[INFO] ------------------------------------------------------------------------
[INFO] Building CommonDomain 1.30.1-SNAPSHOT
[INFO] ------------------------------------------------------------------------
[INFO] 
[INFO] --- maven-clean-plugin:2.5:clean (default-clean) @ CommonDomain ---
[INFO] Deleting <http://108.161.137.201:8081/job/G4S/ws/GasPAR-Commons/CommonDomain/target>
[INFO] 
[INFO] --- maven-resources-plugin:2.3:resources (default-resources) @ CommonDomain ---
[INFO] Using 'UTF-8' encoding to copy filtered resources.
[INFO] Copying 1 resource
[INFO] 
[INFO] --- maven-compiler-plugin:2.3.2:compile (default-compile) @ CommonDomain ---
[INFO] Compiling 95 source files to <http://108.161.137.201:8081/job/G4S/ws/GasPAR-Commons/CommonDomain/target/classes>
[INFO] 
[INFO] --- maven-resources-plugin:2.3:testResources (default-testResources) @ CommonDomain ---
[INFO] Using 'UTF-8' encoding to copy filtered resources.
[INFO] skip non existing resourceDirectory <http://108.161.137.201:8081/job/G4S/ws/GasPAR-Commons/CommonDomain/src/test/resources>
[INFO] 
[INFO] --- maven-compiler-plugin:2.3.2:testCompile (default-testCompile) @ CommonDomain ---
[INFO] Not compiling test sources
[INFO] 
[INFO] --- maven-surefire-plugin:2.10:test (default-test) @ CommonDomain ---
[INFO] Tests are skipped.
[INFO] 
[INFO] --- maven-jar-plugin:2.2:jar (default-jar) @ CommonDomain ---
[INFO] Building jar: <http://108.161.137.201:8081/job/G4S/ws/GasPAR-Commons/CommonDomain/target/CommonDomain-1.30.1-SNAPSHOT.jar>
[INFO] 
[INFO] --- maven-install-plugin:2.3:install (default-install) @ CommonDomain ---
[INFO] Installing <http://108.161.137.201:8081/job/G4S/ws/GasPAR-Commons/CommonDomain/target/CommonDomain-1.30.1-SNAPSHOT.jar> to /var/lib/jenkins/.m2/repository/mx/ssf/sicom/CommonDomain/1.30.1-SNAPSHOT/CommonDomain-1.30.1-SNAPSHOT.jar
[INFO] Installing <http://108.161.137.201:8081/job/G4S/ws/GasPAR-Commons/CommonDomain/pom.xml> to /var/lib/jenkins/.m2/repository/mx/ssf/sicom/CommonDomain/1.30.1-SNAPSHOT/CommonDomain-1.30.1-SNAPSHOT.pom
[INFO]                                                                         
[INFO] ------------------------------------------------------------------------
[INFO] Building CatalogsServices 1.30.1-SNAPSHOT
[INFO] ------------------------------------------------------------------------
[INFO] 
[INFO] --- maven-clean-plugin:2.5:clean (default-clean) @ CatalogsServices ---
[INFO] Deleting <http://108.161.137.201:8081/job/G4S/ws/GasPAR-Commons/CatalogsServices/target>
[INFO] 
[INFO] --- maven-resources-plugin:2.3:resources (default-resources) @ CatalogsServices ---
[INFO] Using 'UTF-8' encoding to copy filtered resources.
[INFO] skip non existing resourceDirectory <http://108.161.137.201:8081/job/G4S/ws/GasPAR-Commons/CatalogsServices/src/main/resources>
[INFO] 
[INFO] --- maven-compiler-plugin:2.3.2:compile (default-compile) @ CatalogsServices ---
[INFO] Compiling 28 source files to <http://108.161.137.201:8081/job/G4S/ws/GasPAR-Commons/CatalogsServices/target/classes>
[INFO] 
[INFO] --- maven-resources-plugin:2.3:testResources (default-testResources) @ CatalogsServices ---
[INFO] Using 'UTF-8' encoding to copy filtered resources.
[INFO] skip non existing resourceDirectory <http://108.161.137.201:8081/job/G4S/ws/GasPAR-Commons/CatalogsServices/src/test/resources>
[INFO] 
[INFO] --- maven-compiler-plugin:2.3.2:testCompile (default-testCompile) @ CatalogsServices ---
[INFO] Not compiling test sources
[INFO] 
[INFO] --- maven-surefire-plugin:2.10:test (default-test) @ CatalogsServices ---
[INFO] Tests are skipped.
[INFO] 
[INFO] --- maven-jar-plugin:2.2:jar (default-jar) @ CatalogsServices ---
[INFO] Building jar: <http://108.161.137.201:8081/job/G4S/ws/GasPAR-Commons/CatalogsServices/target/CatalogsServices-1.30.1-SNAPSHOT.jar>
[INFO] 
[INFO] --- maven-install-plugin:2.3:install (default-install) @ CatalogsServices ---
[INFO] Installing <http://108.161.137.201:8081/job/G4S/ws/GasPAR-Commons/CatalogsServices/target/CatalogsServices-1.30.1-SNAPSHOT.jar> to /var/lib/jenkins/.m2/repository/mx/ssf/sicom/CatalogsServices/1.30.1-SNAPSHOT/CatalogsServices-1.30.1-SNAPSHOT.jar
[INFO] Installing <http://108.161.137.201:8081/job/G4S/ws/GasPAR-Commons/CatalogsServices/pom.xml> to /var/lib/jenkins/.m2/repository/mx/ssf/sicom/CatalogsServices/1.30.1-SNAPSHOT/CatalogsServices-1.30.1-SNAPSHOT.pom
[INFO]                                                                         
[INFO] ------------------------------------------------------------------------
[INFO] Building CorporateStructureService 1.30.1-SNAPSHOT
[INFO] ------------------------------------------------------------------------
[INFO] 
[INFO] --- maven-clean-plugin:2.5:clean (default-clean) @ CorporateStructureService ---
[INFO] Deleting <http://108.161.137.201:8081/job/G4S/ws/GasPAR-Commons/CorporateStructureService/target>
[INFO] 
[INFO] --- maven-resources-plugin:2.3:resources (default-resources) @ CorporateStructureService ---
[INFO] Using 'UTF-8' encoding to copy filtered resources.
[INFO] skip non existing resourceDirectory <http://108.161.137.201:8081/job/G4S/ws/GasPAR-Commons/CorporateStructureService/src/main/resources>
[INFO] 
[INFO] --- maven-compiler-plugin:2.3.2:compile (default-compile) @ CorporateStructureService ---
[INFO] Compiling 17 source files to <http://108.161.137.201:8081/job/G4S/ws/GasPAR-Commons/CorporateStructureService/target/classes>
[INFO] 
[INFO] --- maven-resources-plugin:2.3:testResources (default-testResources) @ CorporateStructureService ---
[INFO] Using 'UTF-8' encoding to copy filtered resources.
[INFO] skip non existing resourceDirectory <http://108.161.137.201:8081/job/G4S/ws/GasPAR-Commons/CorporateStructureService/src/test/resources>
[INFO] 
[INFO] --- maven-compiler-plugin:2.3.2:testCompile (default-testCompile) @ CorporateStructureService ---
[INFO] Not compiling test sources
[INFO] 
[INFO] --- maven-surefire-plugin:2.10:test (default-test) @ CorporateStructureService ---
[INFO] Tests are skipped.
[INFO] 
[INFO] --- maven-jar-plugin:2.2:jar (default-jar) @ CorporateStructureService ---
[INFO] Building jar: <http://108.161.137.201:8081/job/G4S/ws/GasPAR-Commons/CorporateStructureService/target/CorporateStructureService-1.30.1-SNAPSHOT.jar>
[INFO] 
[INFO] --- maven-install-plugin:2.3:install (default-install) @ CorporateStructureService ---
[INFO] Installing <http://108.161.137.201:8081/job/G4S/ws/GasPAR-Commons/CorporateStructureService/target/CorporateStructureService-1.30.1-SNAPSHOT.jar> to /var/lib/jenkins/.m2/repository/mx/ssf/sicom/CorporateStructureService/1.30.1-SNAPSHOT/CorporateStructureService-1.30.1-SNAPSHOT.jar
[INFO] Installing <http://108.161.137.201:8081/job/G4S/ws/GasPAR-Commons/CorporateStructureService/pom.xml> to /var/lib/jenkins/.m2/repository/mx/ssf/sicom/CorporateStructureService/1.30.1-SNAPSHOT/CorporateStructureService-1.30.1-SNAPSHOT.pom
[INFO]                                                                         
[INFO] ------------------------------------------------------------------------
[INFO] Building OperationalServices 1.30.1-SNAPSHOT
[INFO] ------------------------------------------------------------------------
[INFO] 
[INFO] --- maven-clean-plugin:2.5:clean (default-clean) @ OperationalServices ---
[INFO] Deleting <http://108.161.137.201:8081/job/G4S/ws/GasPAR-Commons/OperationalServices/target>
[INFO] 
[INFO] --- maven-resources-plugin:2.3:resources (default-resources) @ OperationalServices ---
[INFO] Using 'UTF-8' encoding to copy filtered resources.
[INFO] skip non existing resourceDirectory <http://108.161.137.201:8081/job/G4S/ws/GasPAR-Commons/OperationalServices/src/main/resources>
[INFO] 
[INFO] --- maven-compiler-plugin:2.3.2:compile (default-compile) @ OperationalServices ---
[INFO] Compiling 44 source files to <http://108.161.137.201:8081/job/G4S/ws/GasPAR-Commons/OperationalServices/target/classes>
[INFO] 
[INFO] --- maven-resources-plugin:2.3:testResources (default-testResources) @ OperationalServices ---
[INFO] Using 'UTF-8' encoding to copy filtered resources.
[INFO] skip non existing resourceDirectory <http://108.161.137.201:8081/job/G4S/ws/GasPAR-Commons/OperationalServices/src/test/resources>
[INFO] 
[INFO] --- maven-compiler-plugin:2.3.2:testCompile (default-testCompile) @ OperationalServices ---
[INFO] Not compiling test sources
[INFO] 
[INFO] --- maven-surefire-plugin:2.10:test (default-test) @ OperationalServices ---
[INFO] Tests are skipped.
[INFO] 
[INFO] --- maven-jar-plugin:2.2:jar (default-jar) @ OperationalServices ---
[INFO] Building jar: <http://108.161.137.201:8081/job/G4S/ws/GasPAR-Commons/OperationalServices/target/OperationalServices-1.30.1-SNAPSHOT.jar>
[INFO] 
[INFO] --- maven-install-plugin:2.3:install (default-install) @ OperationalServices ---
[INFO] Installing <http://108.161.137.201:8081/job/G4S/ws/GasPAR-Commons/OperationalServices/target/OperationalServices-1.30.1-SNAPSHOT.jar> to /var/lib/jenkins/.m2/repository/mx/ssf/sicom/OperationalServices/1.30.1-SNAPSHOT/OperationalServices-1.30.1-SNAPSHOT.jar
[INFO] Installing <http://108.161.137.201:8081/job/G4S/ws/GasPAR-Commons/OperationalServices/pom.xml> to /var/lib/jenkins/.m2/repository/mx/ssf/sicom/OperationalServices/1.30.1-SNAPSHOT/OperationalServices-1.30.1-SNAPSHOT.pom
[INFO]                                                                         
[INFO] ------------------------------------------------------------------------
[INFO] Building JPADataAccess 1.30.1-SNAPSHOT
[INFO] ------------------------------------------------------------------------
[WARNING] The POM for mx.ssf.sicom:UsersManagement:jar:1.30.1-SNAPSHOT is missing, no dependency information available
[INFO] ------------------------------------------------------------------------
[INFO] Reactor Summary:
[INFO] 
[INFO] GasPAR-Commons .................................... SUCCESS [0.611s]
[INFO] CommonDomain ...................................... SUCCESS [5.323s]
[INFO] CatalogsServices .................................. SUCCESS [1.298s]
[INFO] CorporateStructureService ......................... SUCCESS [1.332s]
[INFO] OperationalServices ............................... SUCCESS [1.281s]
[INFO] JPADataAccess ..................................... FAILURE [0.135s]
[INFO] ScalaCommons ...................................... SKIPPED
[INFO] IntegrationCommands ............................... SKIPPED
[INFO] ------------------------------------------------------------------------
[INFO] BUILD FAILURE
[INFO] ------------------------------------------------------------------------
[INFO] Total time: 10.332s
[INFO] Finished at: Mon Feb 08 13:26:48 CST 2016
[INFO] Final Memory: 38M/338M
[INFO] ------------------------------------------------------------------------
[ERROR] Failed to execute goal on project JPADataAccess: Could not resolve dependencies for project mx.ssf.sicom:JPADataAccess:jar:1.30.1-SNAPSHOT: Failure to find mx.ssf.sicom:UsersManagement:jar:1.30.1-SNAPSHOT in http://177.240.165.135:8081/nexus/content/groups/public/ was cached in the local repository, resolution will not be reattempted until the update interval of nexus has elapsed or updates are forced -> [Help 1]
[ERROR] 
[ERROR] To see the full stack trace of the errors, re-run Maven with the -e switch.
[ERROR] Re-run Maven using the -X switch to enable full debug logging.
[ERROR] 
[ERROR] For more information about the errors and possible solutions, please read the following articles:
[ERROR] [Help 1] http://cwiki.apache.org/confluence/display/MAVEN/DependencyResolutionException
[ERROR] 
[ERROR] After correcting the problems, you can resume the build with the command
[ERROR]   mvn <goals> -rf :JPADataAccess
Build step 'Invoke top-level Maven targets' marked build as failure
